banzay-kids.ru
Remember me
Password recovery

People who is andy whitfield dating

Singles Webcams chat room for singles looking to meet online the perfect match they are looking for all their lives.
Klikni na ulaz na chat 2 kako bi laaaagano uletio nekome!

Boost failed updating 56 targets

Rated 3.88/5 based on 704 customer reviews
Free senior nudity cam chat Add to favorites

Online today

Perhaps you would like to add those to your answer. When trying to build a Python module from the Tutorial quickstart from libs\python\example\quickstart , I ran "bjam --toolset=gcc release" using mingw under Windows XP.Then I had unpacked and tried to install according to user manual. You should be able to do something like: sudo apt-get install libboost-dev .install them.I have followed the steps as below: $tar -zxvf boost_1_54_0gz $cd boost_1_54_0/ $./$./b2 install --prefix=PREFIX But I got an error message..... For tophat there are also pre-compiled binaries distributed from the project site which might well be easier to install since you won't need to install all of the source dependencies, just the runtime libraries which are probably on your system already.See for configuration instructions or pass --without-python to note: suppress this message and silently skip all Boost.

This is what happens: [[email protected] hiphop-php]# make [ 1%] Built target timelib [ 2%] Built target xhp [ 2%] Built target afdt [ 11%] Built target mbfl [ 11%] Built target lz4 [ 12%] Built target sqlite3 [ 12%] Building CXX object src/CMake Files/hphp_runtime_static.dir/runtime/base/o In file included from /root/dev/hiphop-php/src/runtime/vm/translator/hopt/tracebuilder.h:22, from /root/dev/hiphop-php/src/runtime/vm/translator/hopt/hhbctranslator.h:23, from /root/dev/hiphop-php/src/runtime/vm/translator/translator-x64.h:31, from /root/dev/hiphop-php/src/runtime/base/intercept.cpp:29: /root/dev/hiphop-php/src/runtime/vm/translator/hopt/ir.h: In constructor âHPHP:: VM:: JIT:: Const Instruction:: Const Instruction(HPHP:: VM:: JIT:: Opcode, HPHP:: VM:: JIT:: Type:: Tag, HPHP::int64)â: /root/dev/hiphop-php/src/runtime/vm/translator/hopt/ir.h:851: error: uninitialized member âHPHP:: VM:: JIT:: Const Instruction::::m_tcaâ with âconstâ type âunsigned char* constâ /root/dev/hiphop-php/src/runtime/vm/translator/hopt/ir.h: In constructor âHPHP:: VM:: JIT:: Const Instruction:: Const Instruction(HPHP:: VM:: JIT:: Opcode, HPHP:: VM:: JIT:: Type:: Tag)â: /root/dev/hiphop-php/src/runtime/vm/translator/hopt/ir.h:857: error: uninitialized member âHPHP:: VM:: JIT:: Const Instruction::::m_tcaâ with âconstâ type âunsigned char* constâ /root/dev/hiphop-php/src/runtime/vm/translator/hopt/ir.h: In constructor âHPHP:: VM:: JIT:: Const Instruction:: Const Instruction(HPHP:: VM:: JIT:: Opcode, HPHP::int64)â: /root/dev/hiphop-php/src/runtime/vm/translator/hopt/ir.h:861: error: uninitialized member âHPHP:: VM:: JIT:: Const Instruction::::m_tcaâ with âconstâ type âunsigned char* constâ /root/dev/hiphop-php/src/runtime/vm/translator/hopt/ir.h: In constructor âHPHP:: VM:: JIT:: Const Instruction:: Const Instruction(HPHP:: VM:: JIT:: Opcode, double)â: /root/dev/hiphop-php/src/runtime/vm/translator/hopt/ir.h:865: error: uninitialized member âHPHP:: VM:: JIT:: Const Instruction::::m_tcaâ with âconstâ type âunsigned char* constâ /root/dev/hiphop-php/src/runtime/vm/translator/hopt/ir.h: In constructor âHPHP:: VM:: JIT:: Const Instruction:: Const Instruction(HPHP:: VM:: JIT:: Opcode, const HPHP:: String Data_)â: /root/dev/hiphop-php/src/runtime/vm/translator/hopt/ir.h:869: error: uninitialized member âHPHP:: VM:: JIT:: Const Instruction::::m_tcaâ with âconstâ type âunsigned char_ constâ /root/dev/hiphop-php/src/runtime/vm/translator/hopt/ir.h: In constructor âHPHP:: VM:: JIT:: Const Instruction:: Const Instruction(HPHP:: VM:: JIT:: Opcode, const HPHP:: Array Data_)â: /root/dev/hiphop-php/src/runtime/vm/translator/hopt/ir.h:874: error: uninitialized member âHPHP:: VM:: JIT:: Const Instruction::::m_tcaâ with âconstâ type âunsigned char_ constâ /root/dev/hiphop-php/src/runtime/vm/translator/hopt/ir.h: In constructor âHPHP:: VM:: JIT:: Const Instruction:: Const Instruction(HPHP:: VM:: JIT:: Opcode, bool)â: /root/dev/hiphop-php/src/runtime/vm/translator/hopt/ir.h:879: error: uninitialized member âHPHP:: VM:: JIT:: Const Instruction::::m_tcaâ with âconstâ type âunsigned char* constâ /root/dev/hiphop-php/src/runtime/vm/translator/hopt/ir.h: In constructor âHPHP:: VM:: JIT:: Const Instruction:: Const Instruction(HPHP:: VM:: JIT:: SSATmp_, HPHP:: VM:: JIT:: Local_)â: /root/dev/hiphop-php/src/runtime/vm/translator/hopt/ir.h:884: error: uninitialized member âHPHP:: VM:: JIT:: Const Instruction::::m_tcaâ with âconstâ type âunsigned char* constâ /root/dev/hiphop-php/src/runtime/vm/translator/hopt/ir.h: In constructor âHPHP:: VM:: JIT:: Const Instruction:: Const Instruction(HPHP:: VM:: JIT:: Opcode, const HPHP:: VM:: Func_)â: /root/dev/hiphop-php/src/runtime/vm/translator/hopt/ir.h:888: error: uninitialized member âHPHP:: VM:: JIT:: Const Instruction::::m_tcaâ with âconstâ type âunsigned char_ constâ /root/dev/hiphop-php/src/runtime/vm/translator/hopt/ir.h: In constructor âHPHP:: VM:: JIT:: Const Instruction:: Const Instruction(HPHP:: VM:: JIT:: Opcode, const HPHP:: VM:: Class_)â: /root/dev/hiphop-php/src/runtime/vm/translator/hopt/ir.h:893: error: uninitialized member âHPHP:: VM:: JIT:: Const Instruction::::m_tcaâ with âconstâ type âunsigned char_ constâ /root/dev/hiphop-php/src/runtime/vm/translator/hopt/ir.h: In constructor âHPHP:: VM:: JIT:: Const Instruction:: Const Instruction(HPHP:: VM:: JIT:: Const Instruction_)â: /root/dev/hiphop-php/src/runtime/vm/translator/hopt/ir.h:898: error: uninitialized member âHPHP:: VM:: JIT:: Const Instruction::::m_tcaâ with âconstâ type âunsigned char_ constâ /root/dev/usr/include/boost/system/error_code.hpp: At global scope: /root/dev/usr/include/boost/system/error_code.hpp:214: warning: âboost::system::posix_categoryâ defined but not used /root/dev/usr/include/boost/system/error_code.hpp:215: warning: âboost::system::errno_ecatâ defined but not used /root/dev/usr/include/boost/system/error_code.hpp:216: warning: âboost::system::native_ecatâ defined but not used make[2]: *** [src/CMake Files/hphp_runtime_static.dir/runtime/base/o] Error 1 make[1]: *** [src/CMake Files/hphp_runtime_static.dir/all] Error 2 make: *** [all] Error 2 [[email protected] hiphop-php]# I gcc built correctly with gcc -v command showing up 4.6.1 and every dependency making correctly with it.call "C:\Program Files\Microsoft Visual Studio 8\VC\vcvarsall.bat" x86 nul link /NOLOGO /INCREMENTAL: NO /DLL /DEBUG /subsystem:console /out:"bin\msvc-8.0\d ebug\std_pair_ext.pyd" /IMPLIB:"bin\msvc-8.0\debug\std_pair_ext.lib" /LIBPATH:"C :\Python25\libs" @"bin\msvc-8.0\debug\std_pair_rsp" if %ERRORLEVEL% NEQ 0 EXIT %ERRORLEVEL% if exist "bin\msvc-8.0\debug\std_pair_manifest" ( mt -nologo -manifest "bin\msvc-8.0\debug\std_pair_manifest" "-outputresource:bin\msvc-8.0\debug\std_pair_ext.pyd;2" ) ...failed dll bin\msvc-8.0\debug\std_pair_bin\msvc-8.0\debug\s td_pair_.../--with-python=/usr/bin/python3 --with-python-root=/usr ./b2 ... gcc.compile.c bin.v2/libs/python/build/gcc-4.9.2/release/threading-multi/object/function_doc_signature.o In file included from ./boost/python/detail/prefix.hpp:13:0, from ./boost/python/converter/registrations.hpp:8, from libs/python/src/object/function_doc_signature.cpp:9: ./boost/python/detail/wrap_python.hpp:: fatal error: pyconfig.h: No such file or directory # include ^ compilation terminated.This was happening to me on centos minimal install so I downloaded the DVD and used the web server install with exactly the same problem. I've followed your instructions and everything works until the make command.I could get it running in ubuntu but centos is just not working for me.$ tar xzfv boost_1_51_0bz2 $ cd boost_1_51_0 $ ./$ ./b2 ... $ ./--without-libraries=wave,graph,graph_parallel $ ./b2 Building the Boost C Libraries.gcc.compile.c bin.v2/libs/wave/build/gcc-4.2.1/release/link-static/threading-multi/cpplexer/re2clex/cpp_re.o gcc.archive bin.v2/libs/wave/build/gcc-4.2.1/release/link-static/threading-multi/libboost_wave.a stage/lib/libboost_wave.a ...failed updating 4 targets... Performing configuration checks - 32-bit : no - 64-bit : yes - x86 : yes - iconv (libc) : no - iconv (separate) : yes - icu : yes - gcc visibility : yes - long double support : no warning: skipping optional Message Passing Interface (MPI) library. note: to suppress this message, pass "--without-mpi" to bjam. note: otherwise, you can safely ignore this message. warning: No python installation configured and autoconfiguration note: failed. The following error happens: C:\Carlos\Apps\boost_1_34_0\libs\python\example\quickstart. C:/Carlos/Apps/boost_1_34_0/tools/build/v2/build\project.jam:312: in load-jamfil e C:/Carlos/Apps/boost_1_34_0/tools/build/v2/build\project.jam:68: in load C:/Carlos/Apps/boost_1_34_0/tools/build/v2/build\project.jam:170: in d C:/Carlos/Apps/boost_1_34_0/tools/build/v2\build-system.jam:237: in load C:\Carlos\Apps\boost_1_34_0\libs\python\example\quickstart\..\..\..\..\tools\bui ld\v2/kernel\modules.jam:261: in import C:\Carlos\Apps\boost_1_34_0\libs\python\example\quickstart\..\..\..\..\tools\bui ld\v2/kernel/bootstrap.jam:132: in boost-build C:\Carlos\Apps\boost_1_34_0\libs\python\example\quickstart\boost-build.jam:7: in The problem is in: rule python-extension unknown in module Jamfile.After talking to some people on #boost, I changed the file: tools/build/v2/and added: using python ; After this, the module compiles correctly.